o-Vanillin, TMS

Van Den Dool and Kratz RI, non-polar column, temperature ramp

Data compiled by: NIST Mass Spectrometry Data Center, William E. Wallace, director

Column type Packed
Active phase SE-30
Column length (m) 3.
Carrier gas N2
Substrate Gas Chrom P (120-140 mesh)
Column diameter (mm)
Phase thickness (μm)
Tstart (C) 100.
Tend (C) 180.
Heat rate (K/min) 1.
Initial hold (min)
Final hold (min)
I 1496.
ReferenceLhuguenot, Maume, et al., 1971
Comment MSDC-RI

References

Lhuguenot, Maume, et al., 1971
Lhuguenot, J.C.; Maume, B.F.; Baron, C., Gas Chromatographic and Mass Spectrometric Study of Vanillin Related Compounds, Chromatographia, 1971, 4, 5, 204-208, https://doi.org/10.1007/BF02281053 . [all data]