Ethylvanilline, MO TMS

Van Den Dool and Kratz RI, non-polar column, temperature ramp

View large format table.

Column type Active phase I Reference Comment
PackedSE-301675.Lhuguenot, Maume, et al., 1971N2, Gas Chrom P (120-140 mesh), 1. K/min; Column length: 3. m; Tstart: 100. C; Tend: 180. C

References

Lhuguenot, Maume, et al., 1971
Lhuguenot, J.C.; Maume, B.F.; Baron, C., Gas Chromatographic and Mass Spectrometric Study of Vanillin Related Compounds, Chromatographia, 1971, 4, 5, 204-208, https://doi.org/10.1007/BF02281053 . [all data]