Tetrahydrofuran, 2-butoxy-3-chloro

Kovats' RI, non-polar column, isothermal

Data compiled by: NIST Mass Spectrometry Data Center, William E. Wallace, director

Column type PackedPacked
Active phase Silicon High Vacuum Grease (obsolete)Silicon High Vacuum Grease (obsolete)
Column length (m)
Carrier gas H2H2
Substrate  Celite
Column diameter (mm)
Phase thickness (μm)
Temperature (C) 170.170.
I 1170.1170.
ReferenceJonas, Janák, et al., 1966Janák, Jonas, et al., 1965
Comment MSDC-RI MSDC-RI

References

Jonas, Janák, et al., 1966
Jonas, J.; Janák, J.; Kratochvíl, M., Structural investigations with the aid of Kovats retention index system on one (nonpolar) stationary phase, J. Gas Chromatogr., 1966, 4, 9, 332-335, https://doi.org/10.1093/chromsci/4.9.332 . [all data]

Janák, Jonas, et al., 1965
Janák, J.; Jonas, J.; Kratochvíl, M., Identification of some acetals of the tetrahydrofurane sereis by gas chromatography with the aid of the Kováts indices, Collect. Czech. Chem. Commun., 1965, 30, 1, 265-276, https://doi.org/10.1135/cccc19650265 . [all data]