2H-Pyran, tetrahydro, 3-chloro, # 1

Kovats' RI, non-polar column, isothermal

Data compiled by: NIST Mass Spectrometry Data Center, William E. Wallace, director

Column type PackedPackedPacked
Active phase Apiezon LApiezon LApiezon L
Column length (m)
Carrier gas H2H2H2
Substrate
Column diameter (mm)
Phase thickness (μm)
Temperature (C) 170.170.170.
I 930.945.935.
ReferenceJonas, Janák, et al., 1966Jonas, Janák, et al., 1966Jonas, Janák, et al., 1966
Comment MSDC-RI MSDC-RI MSDC-RI

References

Jonas, Janák, et al., 1966
Jonas, J.; Janák, J.; Kratochvíl, M., Structural investigations with the aid of Kovats retention index system on one (nonpolar) stationary phase, J. Gas Chromatogr., 1966, 4, 9, 332-335, https://doi.org/10.1093/chromsci/4.9.332 . [all data]