2H-Pyran, tetrahydro-, 2,6-dibutoxy

Kovats' RI, non-polar column, isothermal

Data compiled by: NIST Mass Spectrometry Data Center, William E. Wallace, director

Column type PackedPacked
Active phase Apiezon LApiezon L
Column length (m)  2.
Carrier gas H2
Substrate
Column diameter (mm)
Phase thickness (μm)
Temperature (C) 170.170.
I 1420.1420.
ReferenceJonas, Janák, et al., 1966Jonas, Kratochvíl, et al., 1966
Comment MSDC-RI MSDC-RI

References

Jonas, Janák, et al., 1966
Jonas, J.; Janák, J.; Kratochvíl, M., Structural investigations with the aid of Kovats retention index system on one (nonpolar) stationary phase, J. Gas Chromatogr., 1966, 4, 9, 332-335, https://doi.org/10.1093/chromsci/4.9.332 . [all data]

Jonas, Kratochvíl, et al., 1966
Jonas, J.; Kratochvíl, M.; Gross, H.; Janák, J., Über α-halogenäther XXV. Verwendung des Kovatsschen retentionsiondexsystems zur identifizierung von acetalen der tetrahydropyranreihe, Collect. Czech. Chem. Commun., 1966, 31, 6, 2399-2409, https://doi.org/10.1135/cccc19662399 . [all data]