Hexenal, 3,5,5-trimethyl

Normal alkane RI, non-polar column, custom temperature program

Data compiled by: NIST Mass Spectrometry Data Center, William E. Wallace, director

Column type Capillary
Active phase DB-1
Column length (m) 60.
Carrier gas N2
Substrate
Column diameter (mm) 0.32
Phase thickness (μm) 0.25
Program 40 0C (10 min) 40 - 80 0C at 2 0C/min 80 - 200 0C at 5 0C/min 200 0C (10 min)
I 1046.
ReferenceYen and Lin, 1999
Comment MSDC-RI

References

Yen and Lin, 1999
Yen, G.-C.; Lin, H.-T., Changes in volatile flavor components of guava juice with high-pressure treatment and heat processing and during storage, J. Agric. Food Chem., 1999, 47, 5, 2082-2087, https://doi.org/10.1021/jf9810057 . [all data]