Nilvadipine M (dehydro)

Kovats' RI, non-polar column, temperature ramp

Data compiled by: NIST Mass Spectrometry Data Center, William E. Wallace, director

Column type Capillary
Active phase HP-1
Column length (m) 12.
Carrier gas He
Substrate
Column diameter (mm) 0.20
Phase thickness (μm) 0.33
Tstart (C) 100.
Tend (C) 310.
Heat rate (K/min) 7.
Initial hold (min) 3.
Final hold (min) 8.
I 2565.
ReferenceMaurer and Arlt, 1999
Comment MSDC-RI

References

Maurer and Arlt, 1999
Maurer, H.H.; Arlt, J.W., Screening procedure for detection of dihydropyridine calcium channel blocker metabolites in urine as part of a systematic toxicological analysis procedure for acidic compounds by gas chromatography-mass spectrometry after extractive methylation, J. Anal. Toxicol., 1999, 23, 2, 73-80, https://doi.org/10.1093/jat/23.2.73 . [all data]