Artedouglasia oxide

Normal alkane RI, non-polar column, temperature ramp

View large format table.

Column type Active phase I Reference Comment
CapillaryBP-11542.Mallavarapu, Kulkarni, et al., 199925. m/0.50 mm/0.25 μm, N2, 5. K/min, 220. C @ 10. min; Tstart: 60. C

References

Mallavarapu, Kulkarni, et al., 1999
Mallavarapu, G.R.; Kulkarni, R.N.; Baskaran, K.; Rao, L.; Ramesh, S., Influence of plant growth stage on the essential oil content and composition in Davana (Artemisia pallens Wall.), J. Agric. Food Chem., 1999, 47, 1, 254-258, https://doi.org/10.1021/jf980624c . [all data]