2-Propenal, 3-(4-hydroxy-3,5-dimethoxyphenyl), (Z)-

Normal alkane RI, non-polar column, temperature ramp

Data compiled by: NIST Mass Spectrometry Data Center, William E. Wallace, director

Column type Capillary
Active phase DB-1
Column length (m) 30.
Carrier gas He
Substrate
Column diameter (mm) 0.25
Phase thickness (μm) 0.25
Tstart (C) 50.
Tend (C) 200.
Heat rate (K/min) 5.
Initial hold (min)
Final hold (min)
I 1856.
ReferenceKjällstrand, Ramnäs, et al., 1998
Comment MSDC-RI

References

Kjällstrand, Ramnäs, et al., 1998
Kjällstrand, J.; Ramnäs, O.; Petersson, G., Gas chromatographic and mass spectrometric analysis of 36 lignin-related methoxyphenols from uncontrolled combustion of wood, J. Chromatogr. A, 1998, 824, 2, 205-210, https://doi.org/10.1016/S0021-9673(98)00698-0 . [all data]