2-propyl-2-thiazoline

Normal alkane RI, non-polar column, temperature ramp

Data compiled by: NIST Mass Spectrometry Data Center, William E. Wallace, director

Column type Capillary
Active phase SPB-1
Column length (m) 60.
Carrier gas He
Substrate
Column diameter (mm) 0.32
Phase thickness (μm) 0.25
Tstart (C) 70.
Tend (C) 180.
Heat rate (K/min) 4.
Initial hold (min)
Final hold (min)
I 1041.
ReferenceHuang, Huang, et al., 1998
Comment MSDC-RI

References

Huang, Huang, et al., 1998
Huang, T.-C.; Huang, L.-Z.; Ho, C.-T., Mechanistic studies on thiazolidine formation in aldehyde/cysteamine model systems, J. Agric. Food Chem., 1998, 46, 1, 224-227, https://doi.org/10.1021/jf9705633 . [all data]