2-(2-furfuryl)pyrazine

Normal alkane RI, non-polar column, temperature ramp

Data compiled by: NIST Mass Spectrometry Data Center, William E. Wallace, director

Column type CapillaryCapillary
Active phase DB-1DB-1
Column length (m) 60.60.
Carrier gas HeHe
Substrate
Column diameter (mm) 0.320.32
Phase thickness (μm) 1.1.0
Tstart (C) 40.40.
Tend (C) 260.260.
Heat rate (K/min) 2.2.
Initial hold (min)
Final hold (min)
I 1279.1279.
ReferenceChen and Ho, 1999Chen and Ho, 1998
Comment MSDC-RI MSDC-RI

References

Chen and Ho, 1999
Chen, J.; Ho, C.-T., Comparison of volatile generation in serine/threonine/glutamine-ribose/glucose/fructose model systems, J. Agric. Food Chem., 1999, 47, 2, 643-647, https://doi.org/10.1021/jf980771a . [all data]

Chen and Ho, 1998
Chen, J.; Ho, C.-T., Volatile compounds generated in serine-monosaccharide model systems, J. Agric. Food Chem., 1998, 46, 4, 1518-1522, https://doi.org/10.1021/jf970934f . [all data]