(Z)-10-Hexadecenyl acetate

Kovats' RI, non-polar column, isothermal

View large format table.

Column type Active phase Temperature (C) I Reference Comment
PackedApiezon L210.1929.Nedopekina, Kovalev, et al., 1981N2, Chromatron N-AW-HMDS; Column length: 2.5 m

Van Den Dool and Kratz RI, non-polar column, temperature ramp

View large format table.

Column type Active phase I Reference Comment
CapillaryDB-51998.Marques, McElfresh, et al., 200030. m/0.25 mm/0.25 μm, 100. C @ 1. min, 5. K/min, 275. C @ 3. min

Van Den Dool and Kratz RI, polar column, temperature ramp

View large format table.

Column type Active phase I Reference Comment
CapillaryDB-Wax2322.Marques, McElfresh, et al., 200030. m/0.32 mm/0.25 μm, 100. C @ 1. min, 5. K/min; Tend: 240. C

References

Nedopekina, Kovalev, et al., 1981
Nedopekina, S.F.; Kovalev, B.G.; Kost, A.N., Use of Kovats indices for idetifying sex pheromones, Chem. Nat. Compd. (Engl. Transl.), 1981, 17, 4, 376-380, https://doi.org/10.1007/BF01185272 . [all data]

Marques, McElfresh, et al., 2000
Marques, F.A.; McElfresh, J.S.; Millar, J.G., Kováts retention indexes of monounsaturated C12, C14, and C16 alcohols, acetates and aldehydes commonly found in lepidopteran pheromone blends, J. Braz. Chem. Soc., 2000, 11, 6, 592-599, https://doi.org/10.1590/S0103-50532000000600007 . [all data]