Butyrospermol, TMS

Van Den Dool and Kratz RI, non-polar column, temperature ramp

View large format table.

Column type Active phase I Reference Comment
CapillaryOV-53366.García, Sáenz, et al., 199725. m/0.25 mm/0.23 μm, He, 230. C @ 6. min, 4. K/min; Tend: 300. C

References

García, Sáenz, et al., 1997
García, M.D.; Sáenz, M.T.; Ahumada, M.D.; Cert, A., Isolation of three triterpenes and several aliphatic alcohols from Crataegus monogyna Jacq., J. Chromatogr. A, 1997, 767, 1-2, 340-342, https://doi.org/10.1016/S0021-9673(96)01091-6 . [all data]