2,3,5-trimethyl-benzothiophene

Lee's RI, non-polar column, temperature ramp

View large format table.

Column type Active phase I Reference Comment
CapillaryOV-73263.0Arpino, Ignatiadis, et al., 198768. m/0.28 mm/0.15 μm, 1.5 K/min

References

Arpino, Ignatiadis, et al., 1987
Arpino, P.J.; Ignatiadis, I.; de Rycke, G., Sulphur-containing polynuclear aromatic hydrocarbons from petroleum. Examination of their possible statistical formation in sediments, J. Chromatogr., 1987, 390, 2, 329-348, https://doi.org/10.1016/S0021-9673(01)94385-7 . [all data]