Bisphenol F diglycidyl ether, ortho-ortho'

Normal alkane RI, non-polar column, temperature ramp

Data compiled by: NIST Mass Spectrometry Data Center, William E. Wallace, director

Column type Capillary
Active phase Methyl Silicone
Column length (m) 10.
Carrier gas He
Substrate
Column diameter (mm) 0.32
Phase thickness (μm) 0.1
Tstart (C) 60.
Tend (C) 380.
Heat rate (K/min) 12.
Initial hold (min) 1.
Final hold (min) 15.
I 2453.
ReferenceTóth and Garay, 1994
Comment MSDC-RI

References

Tóth and Garay, 1994
Tóth, T.; Garay, F., Separation of novolac resin oligomers and related industrial materials by high temperature capillary gas chromatography, J. Hi. Res. Chromatogr., 1994, 17, 3, 177-179, https://doi.org/10.1002/jhrc.1240170312 . [all data]