Propanoic acid, 4-methoxyphenyl ester

Van Den Dool and Kratz RI, non-polar column, temperature ramp

View large format table.

Column type Active phase I Reference Comment
CapillaryDB-11481.Stashenko, Martinez, et al., 199560. m/0.25 mm/0.25 μm, He, 40. C @ 3. min, 2. K/min, 160. C @ 15. min

Van Den Dool and Kratz RI, polar column, temperature ramp

View large format table.

Column type Active phase I Reference Comment
CapillaryDB-Wax1705.Stashenko, Martinez, et al., 199560. m/0.25 mm/0.25 μm, He, 40. C @ 3. min, 2. K/min, 160. C @ 15. min

References

Stashenko, Martinez, et al., 1995
Stashenko, E.E.; Martinez, C.R.; Martinez, J.R.; Shibamoto, T., Catalytic transformation of anise (Pimpinella anisum L.) oil over zeolite Y, J. Hi. Res. Chromatogr., 1995, 18, 8, 501-503, https://doi.org/10.1002/jhrc.1240180810 . [all data]