Methyl 2-chlorobutenoate

Normal alkane RI, non-polar column, temperature ramp

Data compiled by: NIST Mass Spectrometry Data Center, William E. Wallace, director

Column type CapillaryCapillary
Active phase HP-1HP-1
Column length (m) 25.25.
Carrier gas HeHe
Substrate
Column diameter (mm) 0.20.2
Phase thickness (μm) 0.330.33
Tstart (C) 50.50.
Tend (C) 300.300.
Heat rate (K/min) 8.8.
Initial hold (min) 5.5.
Final hold (min) 10.10.
I 874.888.
ReferencePeters, de Leer, et al., 1994Peters, de Leer, et al., 1994
Comment MSDC-RI MSDC-RI

References

Peters, de Leer, et al., 1994
Peters, R.J.D.; de Leer, E.W.B.; Versteegh, J.F.M., Identification of Halogenated Compounds Produced by Chlorination of Humic Acid in the Presence of Bromide, J. Chromatogr. A, 1994, 686, 2, 253-261, https://doi.org/10.1016/0021-9673(94)00719-5 . [all data]