Dimethyl 2,3-dichlorobutenedioate

Normal alkane RI, non-polar column, temperature ramp

View large format table.

Column type Active phase I Reference Comment
CapillaryHP-11216.Peters, de Leer, et al., 199425. m/0.2 mm/0.33 μm, He, 50. C @ 5. min, 8. K/min, 300. C @ 10. min
CapillaryHP-11222.Peters, de Leer, et al., 199425. m/0.2 mm/0.33 μm, He, 50. C @ 5. min, 8. K/min, 300. C @ 10. min

References

Peters, de Leer, et al., 1994
Peters, R.J.D.; de Leer, E.W.B.; Versteegh, J.F.M., Identification of Halogenated Compounds Produced by Chlorination of Humic Acid in the Presence of Bromide, J. Chromatogr. A, 1994, 686, 2, 253-261, https://doi.org/10.1016/0021-9673(94)00719-5 . [all data]