GA88, MeTMS

Normal alkane RI, non-polar column, temperature ramp

Data compiled by: NIST Mass Spectrometry Data Center, William E. Wallace, director

Column type Capillary
Active phase DB-1
Column length (m) 15.
Carrier gas
Substrate
Column diameter (mm) 0.258
Phase thickness (μm)
Tstart (C) 160.
Tend (C) 280.
Heat rate (K/min) 16.
Initial hold (min) 2.
Final hold (min)
I 2491.
ReferenceOyama, Yamauchi, et al., 1996
Comment MSDC-RI

References

Oyama, Yamauchi, et al., 1996
Oyama, N.; Yamauchi, T.; Yamane, H.; Murofushi, N.; Agatsuma, M.; Pour, M.; Mander, L.N., Identification of gibberellins and 9,15-cyclogibberellins in developing apple seeds, Biosci. Biotechnol. Biochem., 1996, 60, 2, 305-308, https://doi.org/10.1271/bbb.60.305 . [all data]