GA60, MeTMSi

Van Den Dool and Kratz RI, non-polar column, custom temperature program

Data compiled by: NIST Mass Spectrometry Data Center, William E. Wallace, director

Column type CapillaryCapillaryCapillary
Active phase OV-1OV-1DB-1
Column length (m) 25.25.15.
Carrier gas
Substrate
Column diameter (mm) 0.20.20.22
Phase thickness (μm) 0.250.250.25
Program 60C(2min) => 10C/min => 150C => 3C/min => 300C60C(2min) => 10C/min => 150C => 3C/min => 300C60(0.1 min)-200 0C at 20 deg/min; 200-300 0C at 5 deg/min
I 2575.2580.2583.
ReferenceSantes, Hedden, et al., 1995Santes, Hedden, et al., 1995Pearce, Koshioka, et al., 1994
Comment MSDC-RI MSDC-RI MSDC-RI

References

Santes, Hedden, et al., 1995
Santes, C.M.; Hedden, P.; Gaskin, P.; Garcia-Martinez, J.L., Gibberellins and related compounds in young fruits of pea and their relationship to fruit-set, Phytochemistry, 1995, 40, 5, 1347-1355, https://doi.org/10.1016/0031-9422(95)00489-T . [all data]

Pearce, Koshioka, et al., 1994
Pearce, D.W.; Koshioka, M.; Pharis, R.P., Chromatography of gibberellins, J. Chromatogr. A, 1994, 658, 1, 91-122, https://doi.org/10.1016/0021-9673(94)85210-3 . [all data]