GA53, MeTMS

Kovats' RI, non-polar column, custom temperature program

Data compiled by: NIST Mass Spectrometry Data Center, William E. Wallace, director

Column type CapillaryCapillaryCapillaryCapillaryCapillary
Active phase HP-5HP-5DB-1DB-1Ultra-2
Column length (m)   15.15.25.
Carrier gas
Substrate
Column diameter (mm)   0.250.2580.32
Phase thickness (μm)   0.25 0.52
Program not specifiednot specifiednot specified130C(2m) => 32C/min => 220(4min) => 8C/min270C(2min)50C => 40C/min => 220C => 6C/min => 280C
I 2503.2504.2493.2503.2464.
ReferenceMorvan-Bertrand, Ernstsen, et al., 2001Morvan-Bertrand, Ernstsen, et al., 2001Koshioka, Miyamoto, et al., 1998Tanno, Yokota, et al., 1992Talon, Koornneef, et al., 1990
Comment MSDC-RI MSDC-RI MSDC-RI MSDC-RI MSDC-RI
Column type CapillaryCapillaryCapillary
Active phase Ultra-2Ultra-2Ultra-2
Column length (m) 25.25.25.
Carrier gas   He
Substrate
Column diameter (mm) 0.320.320.32
Phase thickness (μm) 0.520.520.52
Program 50C => 40C/min => 220C => 6C/min => 280C50C => 40C/min => 220C => 6C/min => 280C50C => 40C/min => 220C => 6C/min => 280C
I 2468.2468.2468.
ReferenceTalon, Koornneef, et al., 1990Talon, Koornneef, et al., 1990Talon and Zeevaart, 1990
Comment MSDC-RI MSDC-RI MSDC-RI

References

Morvan-Bertrand, Ernstsen, et al., 2001
Morvan-Bertrand, A.; Ernstsen, A.; Lindgård, B.; Koshioka, M.; le Saos, J.; Boucaud, J.; Prud'homme, M.-P.; Junttila, O., Endogenous gibberellins in Lolium perenne and influence of defoliation on their contents in elongating leaf bases and in leaf sheaths, Physiol. Plant., 2001, 111, 2, 225-231, https://doi.org/10.1034/j.1399-3054.2001.1110214.x . [all data]

Koshioka, Miyamoto, et al., 1998
Koshioka, M.; Miyamoto, K.; Horio, T.; Namura, S.; Hisamatsu, T.; Kubota, S.; Ernstsen, A.; Junttila, O.; Mander, L.N., Identification of endogenous gibberellins in stems and leaves in vegetative growth stage of Gentiana triflora, J. Plant Physiol., 1998, 153, 1-2, 230-232, https://doi.org/10.1016/S0176-1617(98)80071-0 . [all data]

Tanno, Yokota, et al., 1992
Tanno, N.; Yokota, T.; Abe, M.; Okagami, N., Identification of endogenous gibberellins in dormant bulbils of Chinese yam, Dioscorea opposita, Plant Physiol., 1992, 100, 4, 1823-1826, https://doi.org/10.1104/pp.100.4.1823 . [all data]

Talon, Koornneef, et al., 1990
Talon, M.; Koornneef, M.; Zeevaart, J.A.D., Endogenous gibberellins in Arabidopsis thaliana and possible steps blocked in the biosynthetic pathways of the semidwarf ga4 and ga5 mutants, Proc. Nat. Acad. Sci. U.S.A., 1990, 87, 20, 7983-7987, https://doi.org/10.1073/pnas.87.20.7983 . [all data]

Talon and Zeevaart, 1990
Talon, M.; Zeevaart, J.A.D., Gibberellins and stem growth as related to photoperiod in Silene armeria L., Plant Physiol., 1990, 92, 4, 1094-1100, https://doi.org/10.1104/pp.92.4.1094 . [all data]