GA4 MeTMS

Van Den Dool and Kratz RI, non-polar column, custom temperature program

Data compiled by: NIST Mass Spectrometry Data Center, William E. Wallace, director

Column type CapillaryCapillaryCapillaryCapillaryCapillary
Active phase PE-1HTHP-1HP-1DB-1OV-1
Column length (m) 30.30.30.15.25.
Carrier gas HeHeHe
Substrate
Column diameter (mm) 0.320.250.250.250.2
Phase thickness (μm) 0.10.250.250.330.25
Program 60C => 45C/min => 220C => 4C/min => 300C60C (1min) => 15C/min => 200C => 5C/min => 285C60C (1min) => 15C/min => 200C => 5C/min => 285C120(2min) => (16C/min) => 216(5min) => (8C/min) => 280C60C(2min) => 10C/min => 150C => 3C/min => 300C
I 2498.2506.2506.2500.2503.
ReferenceFrisse, Pimenta, et al., 2003Kim, Lee, et al., 2003Kim, Lee, et al., 2003Hisamatsu, Koshioka, et al., 1998Webb, Appleford, et al., 1998
Comment MSDC-RI MSDC-RI MSDC-RI MSDC-RI MSDC-RI
Column type CapillaryCapillaryCapillaryCapillaryCapillary
Active phase BP-1DB-1DB-1CP Sil 5 CBCP Sil 5 CB
Column length (m) 25.30.30.30.30.
Carrier gas  HeHeHeHe
Substrate
Column diameter (mm) 0.20.250.250.250.25
Phase thickness (μm) 0.1  0.40.4
Program 60C(2min) => 10C/min => 150C => 3C/min => 300C40C (2min) => 10C/min => 150C => 3C/min => 300C40C (2min) => 10C/min => 150C => 3C/min => 300C200C => 25C/min => 250C => 4C/min => 280C(4min)200C => 25C/min => 250C => 4C/min => 280C(4min)
I 2515.2507.2509.2522.2522.
ReferenceWebb, Appleford, et al., 1998Grünzweig, Rabinowitch, et al., 1997Grünzweig, Rabinowitch, et al., 1997Kappers, Jordi, et al., 1997Kappers, Jordi, et al., 1997
Comment MSDC-RI MSDC-RI MSDC-RI MSDC-RI MSDC-RI
Column type CapillaryCapillaryCapillaryCapillaryCapillary
Active phase DB-1BP-1DB-1DB-1DB-1
Column length (m) 15.25.15.15.15.
Carrier gas HeHeHeHe
Substrate
Column diameter (mm) 0.250.20.250.250.22
Phase thickness (μm) 0.250.10.250.250.25
Program 80C(1min) => 30C/min => 245C => 5C/min => 300C60C(2min) => 10C/min => 150C => 3C/min => 300C(10min)60C(1min) => 20C/min => 200C => 4C/min => 260C60C(1min) => 20C/min => 200C => 4C/min => 260C60(0.1 min)-200 0C at 20 deg/min; 200-300 0C at 5 deg/min
I 2510.2493.2501.2502.2519.
ReferenceRijnders, Yang, et al., 1997MacMillan and Gaskin, 1996Ridoutt, Pharis, et al., 1995Ridoutt, Pharis, et al., 1995Pearce, Koshioka, et al., 1994
Comment MSDC-RI MSDC-RI MSDC-RI MSDC-RI MSDC-RI
Column type CapillaryCapillaryCapillaryCapillary
Active phase SE-52SE-52OV-1OV-1
Column length (m) 25.25.25.25.
Carrier gas HeHe He
Substrate
Column diameter (mm) 0.220.220.20.2
Phase thickness (μm) 0.250.250.25
Program 50C => 15C/min => 240C => 4C/min => 300C50C => 15C/min => 240C => 4C/min => 300C50C(2min) => 10C/min => 150C => 3C/min => 300C60C(2min) => 13C/min => 150C => 3C/min => 280C(10min)
I 2496.2497.2510.2497.
ReferenceHedden, Hoad, et al., 1993Hedden, Hoad, et al., 1993Kobayashi, Gaskin, et al., 1993Gaskin, Gilmour, et al., 1984
Comment MSDC-RI MSDC-RI MSDC-RI MSDC-RI

Normal alkane RI, non-polar column, temperature ramp

Data compiled by: NIST Mass Spectrometry Data Center, William E. Wallace, director

Column type CapillaryCapillaryCapillary
Active phase DB-1DB-1DB-1
Column length (m) 15.15.15.
Carrier gas
Substrate
Column diameter (mm) 0.2580.2580.258
Phase thickness (μm)
Tstart (C) 160.160.160.
Tend (C) 280.280.280.
Heat rate (K/min) 16.16.16.
Initial hold (min) 2.2.2.
Final hold (min)
I 2501.2502.2500.
ReferenceOyama, Yamauchi, et al., 1996Oyama, Yamauchi, et al., 1996Oyama, Yamauchi, et al., 1996, 2
Comment MSDC-RI MSDC-RI MSDC-RI

References

Frisse, Pimenta, et al., 2003
Frisse, A.; Pimenta, M.J.; Lange, T., Expression studies of gibberellin oxidases in developing pumpkin seeds, Plant Physiol., 2003, 131, 3, 1220-1227, retrieved from http://www.plantphysiol.org, https://doi.org/10.1104/pp.015206 . [all data]

Kim, Lee, et al., 2003
Kim, S.-K.; Lee, S.-C.; Shin, D.-H.; Jang, S.-W.; Nam, J.-W.; Park, T.-S.; Lee, I.-J., Quantification of endogenous gibberellins in leaves and tubers of Chinese yam, Dioscorea opposita Thunb. cv. Tsukune during tuber enlargement, Plant Growth Regul., 2003, 39, 2, 125-130, https://doi.org/10.1023/A:1022569506883 . [all data]

Hisamatsu, Koshioka, et al., 1998
Hisamatsu, T.; Koshioka, M.; Kubota, S.; Nishijima, T.; Yamane, H.; King, R.W.; Mander, L.N., Isolation and identification of GA112 (12β-hydroxy-GA12) in Matthiola incana, Phytochemistry, 1998, 47, 1, 3-6, https://doi.org/10.1016/S0031-9422(97)00543-8 . [all data]

Webb, Appleford, et al., 1998
Webb, S.E.; Appleford, N.E.J.; Gaskin, P.; Lenton, J.R., Gibberellins in internodes and ears of wheat containing different dwarfing alleles, Phytochemistry, 1998, 47, 5, 671-677, https://doi.org/10.1016/S0031-9422(97)00684-5 . [all data]

Grünzweig, Rabinowitch, et al., 1997
Grünzweig, J.M.; Rabinowitch, H.D.; Katan, J.; Wodner, M.; Ben-Tal, Y., Endogenous gibberellins in foliage of tomato (Lycopersicon esculentum), Phytochemistry, 1997, 46, 5, 811-815, https://doi.org/10.1016/S0031-9422(97)00383-X . [all data]

Kappers, Jordi, et al., 1997
Kappers, I.F.; Jordi, W.; Maas, F.M.; van der Plas, L.H.W., Gibberellins in leaves of Alstroemeria hybrida: identification and quantification in relation to leaf age, J. Plant Growth Regul., 1997, 16, 4, 219-225, https://doi.org/10.1007/PL00007000 . [all data]

Rijnders, Yang, et al., 1997
Rijnders, J.G.H.M.; Yang, Y.-Y.; Kamiya, Y.; Takahashi, N.; Barendse, G.W.M.; Blom, C.W.P.M.; Voesenek, L.A.C.J., Ethylene enhances gibberellin levels and petiole sensitivity in flooding-tolerant Rumex palustris but not in flooding-intolerant R. acetosa, Planta, 1997, 203, 1, 20-25, https://doi.org/10.1007/s00050160 . [all data]

MacMillan and Gaskin, 1996
MacMillan, J.; Gaskin, P., Gibberellins in endosperm and embryos of Marah macrocarpus, Phytochemistry, 1996, 42, 5, 1263-1266, https://doi.org/10.1016/0031-9422(96)00179-3 . [all data]

Ridoutt, Pharis, et al., 1995
Ridoutt, B.G.; Pharis, R.P.; Sands, R., Identification and quantification of cambial region hormones of Eucalyptus globulus, Plant Cell Physiol., 1995, 36, 6, 1143-1147. [all data]

Pearce, Koshioka, et al., 1994
Pearce, D.W.; Koshioka, M.; Pharis, R.P., Chromatography of gibberellins, J. Chromatogr. A, 1994, 658, 1, 91-122, https://doi.org/10.1016/0021-9673(94)85210-3 . [all data]

Hedden, Hoad, et al., 1993
Hedden, P.; Hoad, G.V.; Gaskin, P.; Lewis, M.J.; Green, J.R.; Furber, M.; Mander, L.N., Kaurenoids and gibberellins, including the newly characterized gibberellin A88, in developing apple seeds, Phytochemistry, 1993, 32, 2, 231-237, https://doi.org/10.1016/S0031-9422(00)94973-2 . [all data]

Kobayashi, Gaskin, et al., 1993
Kobayashi, M.; Gaskin, P.; Spray, C.R.; Suzuki, Y.; Phinney, B.O.; MacMillan, J., Metabolism and biological activity of Gibberellin A4 in vegetative shoots of Zea mays, Oryza sativa, and Arabidopsis thaliana, Plant Physiol., 1993, 102, 379-386. [all data]

Gaskin, Gilmour, et al., 1984
Gaskin, P.; Gilmour, S.J.; Lenton, J.R.; MacMillan, J.; Sponsel, V.M., Endogenous gibberellins and kauranoids identified from developing and germinating barley grain, J. Plant Growth Regul., 1984, 2, 1-4, 229-242, https://doi.org/10.1007/BF02042252 . [all data]