2-ethyl-4-methyl-1,3-dithiolane

Kovats' RI, non-polar column, isothermal

Data compiled by: NIST Mass Spectrometry Data Center, William E. Wallace, director

Column type CapillaryCapillaryCapillaryCapillaryCapillary
Active phase OV-101OV-101SE-52SE-52OV-101
Column length (m) 50.50.60.60.50.
Carrier gas HeHeHeHeHe
Substrate
Column diameter (mm) 0.320.320.320.320.32
Phase thickness (μm)   2.2.0.5
Temperature (C) 130.150.130.150.130.
I 1130.1142.1156.1174.1130.
ReferenceMisharina and Golovnya, 1994Misharina and Golovnya, 1994Misharina and Golovnya, 1994Misharina and Golovnya, 1994Misharina, Golovnya, et al., 1993
Comment MSDC-RI MSDC-RI MSDC-RI MSDC-RI MSDC-RI

Van Den Dool and Kratz RI, non-polar column, temperature ramp

View large format table.

Column type Active phase I Reference Comment
CapillaryOV-1011117.Misharina and Golovnya, 1994He, 50. C @ 0. min, 4. K/min; Column length: 50. m; Column diameter: 0.32 mm; Tend: 200. C
CapillarySE-521153.Misharina and Golovnya, 199460. m/0.32 mm/2. μm, He, 50. C @ 0. min, 4. K/min; Tend: 200. C

References

Misharina and Golovnya, 1994
Misharina, T.A.; Golovnya, R.V., Spectral and gas-chromatographic characterization of 4-methyl-2-alkyl substituted 1,3-oxothiolanes and 1,3-dithiolanes, Zh. Anal. Khim., 1994, 49, 4, 395-401. [all data]

Misharina, Golovnya, et al., 1993
Misharina, T.A.; Golovnya, R.V.; Beletsky, I.V., Sorption properties of heterocyclic compounds differing by heteroatom in capillary gas chromatography, Russ. Chem. Bull. (Engl. Transl.), 1993, 42, 7, 1167-1170, https://doi.org/10.1007/BF00701998 . [all data]