2,4-Dimethyl-1,3-dithiolane

Kovats' RI, non-polar column, isothermal

View large format table.

Column type Active phase Temperature (C) I Reference Comment
CapillaryOV-101130.1032.Misharina and Golovnya, 1994He; Column length: 50. m; Column diameter: 0.32 mm
CapillaryOV-101150.1044.Misharina and Golovnya, 1994He; Column length: 50. m; Column diameter: 0.32 mm
CapillarySE-52130.1060.Misharina and Golovnya, 199460. m/0.32 mm/2. μm, He
CapillarySE-52150.1078.Misharina and Golovnya, 199460. m/0.32 mm/2. μm, He
CapillaryOV-101130.1032.Misharina, Golovnya, et al., 199350. m/0.32 mm/0.5 μm, He
PackedApiezon M130.1060.Garbuzov, Misharina, et al., 1985He or N2, Chromosorb W, AW-DMCS; Column length: 2.1 m

Van Den Dool and Kratz RI, non-polar column, temperature ramp

View large format table.

Column type Active phase I Reference Comment
CapillaryOV-1011012.Misharina and Golovnya, 1994He, 50. C @ 0. min, 4. K/min; Column length: 50. m; Column diameter: 0.32 mm; Tend: 200. C
CapillarySE-521050.Misharina and Golovnya, 199460. m/0.32 mm/2. μm, He, 50. C @ 0. min, 4. K/min; Tend: 200. C

Normal alkane RI, non-polar column, custom temperature program

View large format table.

Column type Active phase I Reference Comment
CapillaryMethyl Silicone1032.Misharina, 1995Program: not specified

References

Misharina and Golovnya, 1994
Misharina, T.A.; Golovnya, R.V., Spectral and gas-chromatographic characterization of 4-methyl-2-alkyl substituted 1,3-oxothiolanes and 1,3-dithiolanes, Zh. Anal. Khim., 1994, 49, 4, 395-401. [all data]

Misharina, Golovnya, et al., 1993
Misharina, T.A.; Golovnya, R.V.; Beletsky, I.V., Sorption properties of heterocyclic compounds differing by heteroatom in capillary gas chromatography, Russ. Chem. Bull. (Engl. Transl.), 1993, 42, 7, 1167-1170, https://doi.org/10.1007/BF00701998 . [all data]

Garbuzov, Misharina, et al., 1985
Garbuzov, V.G.; Misharina, T.A.; Aerov, A.F.; Golovnya, R.V., Gas chromatographic retention indices for sulphur(II)-containing organic substances, J. Anal. Chem. USSR (Engl. Transl.), 1985, 40, 4, 576-586. [all data]

Misharina, 1995
Misharina, T.A., Sorption regularities of sulfur- and oxygen-containing compounds in chromatography and their application in identification of volatile organic compounds, Diss. degree of Dr. Sci. (Chemistry), 1995, 52. [all data]