Guaia-1(10),11-dien-9-one

Normal alkane RI, non-polar column, custom temperature program

Data compiled by: NIST Mass Spectrometry Data Center, William E. Wallace, director

Column type CapillaryCapillary
Active phase SE-30DB-1
Column length (m)
Carrier gas
Substrate
Column diameter (mm)
Phase thickness (μm)
Program not specifiednot specified
I 1752.1752.
ReferenceVinogradov, 2004Ishihara, Tsuneya, et al., 1993
Comment MSDC-RI MSDC-RI

References

Vinogradov, 2004
Vinogradov, B.A., Production, composition, properties and application of essential oils, 2004, retrieved from http://viness.narod.ru. [all data]

Ishihara, Tsuneya, et al., 1993
Ishihara, M.; Tsuneya, T.; Uneyama, K., Components of the Volatile Concentrate of Agarwood, J. Essent. Oil Res., 1993, 5, 3, 283-289, https://doi.org/10.1080/10412905.1993.9698221 . [all data]