β-Epilactose, TMS

Kovats' RI, non-polar column, isothermal

Data compiled by: NIST Mass Spectrometry Data Center, William E. Wallace, director

Column type Capillary
Active phase SE-54
Column length (m) 40.
Carrier gas N2
Substrate
Column diameter (mm) 0.18
Phase thickness (μm)
Temperature (C) 280.
I 2723.
ReferenceGarcía-Raso, Páez, et al., 1992
Comment MSDC-RI

References

García-Raso, Páez, et al., 1992
García-Raso, A.; Páez, M.I.; Martínez-Castro, I.; Sanz, J.; Calvo, M.M., Gas chromatographic retention of carbohydrate trimethylsilyl ethers. IV. Disaccharides, J. Chromatogr., 1992, 607, 2, 221-225, https://doi.org/10.1016/0021-9673(92)87079-N . [all data]