α-Galactobiose, TMS

Kovats' RI, non-polar column, isothermal

View large format table.

Column type Active phase Temperature (C) I Reference Comment
CapillarySE-54280.2831.García-Raso, Páez, et al., 1992N2; Column length: 40. m; Column diameter: 0.18 mm

References

García-Raso, Páez, et al., 1992
García-Raso, A.; Páez, M.I.; Martínez-Castro, I.; Sanz, J.; Calvo, M.M., Gas chromatographic retention of carbohydrate trimethylsilyl ethers. IV. Disaccharides, J. Chromatogr., 1992, 607, 2, 221-225, https://doi.org/10.1016/0021-9673(92)87079-N . [all data]