2,10-dimethylphenanthrene

Lee's RI, non-polar column, temperature ramp

Data compiled by: NIST Mass Spectrometry Data Center, William E. Wallace, director

Column type CapillaryCapillaryCapillaryCapillary
Active phase DB-5MSHP-5DB-5CP Sil 8 CB
Column length (m) 30.30.30.50.
Carrier gas  HeliumHeH2
Substrate
Column diameter (mm) 0.250.250.320.22
Phase thickness (μm) 0.250.250.250.13
Tstart (C) 50.50.50.120.
Tend (C) 300.310.300.270.
Heat rate (K/min) 6.6.6.3.
Initial hold (min) 2.1.52.2.
Final hold (min) 16.10.
I 340.08340.79341.75339.80
ReferenceSun, Zhou, et al., 2008Pedersen, Durant, et al., 2005Wang, Fingas, et al., 1994Garrigues, Parlanti, et al., 1987
Comment MSDC-RI MSDC-RI MSDC-RI MSDC-RI

Normal alkane RI, non-polar column, temperature ramp

View large format table.

Column type Active phase I Reference Comment
CapillaryOV-12011.Asif and Fazeelat, 2006Nitrogen, 4. K/min; Column length: 30. m; Column diameter: 0.25 mm; Tstart: 60. C; Tend: 290. C

Lee's RI, non-polar column, custom temperature program

View large format table.

Column type Active phase I Reference Comment
CapillaryLM-5339.47Ré-Poppi and Santiago-Silva, 200530. m/0.25 mm/0.25 μm, He; Program: 60C(2min) => 15C/min => 180C => 5C/min => 280C (10min)
CapillaryDB-5339.65Zamperlini, Silva, et al., 199730. m/0.25 mm/0.25 μm, He; Program: 90C (1min) => 10C/min => 120C => 4C/min => 310C (20min)

References

Sun, Zhou, et al., 2008
Sun, P.; Zhou, Q.; Li, G.; Wang, X.; Zhao, Y.; Cao, L., fingerprint analysis of polycyclic aromatic hydrocarbons in crude oil by internal standard method, J. Instrumental Anal., 2008, 27, 4, 344-348. [all data]

Pedersen, Durant, et al., 2005
Pedersen, D.U.; Durant, J.L.; Taghizadeh, K.; Hemond, H.F.; Lafleur, A.L.; Cass, G.R., Human cell mutagenes in respirable airborne particles from the Northeastern United States. 2. Quantification of mutagenes and other organic compounds., Environ. Sci. Technol., 2005, 39, 24, 9547-9560, https://doi.org/10.1021/es050886c . [all data]

Wang, Fingas, et al., 1994
Wang, Z.; Fingas, M.; Li, K., Fractionation of a light crude oil and identification and quantitation of aliphatic, aromatic, and biomarker comopunds by GC-FID and GC-MS, Part II, J. Chromatogr. Sci., 1994, 32, 9, 367-382, https://doi.org/10.1093/chromsci/32.9.367 . [all data]

Garrigues, Parlanti, et al., 1987
Garrigues, P.; Parlanti, E.; Radke, M.; Bellocq, J.; Willsch, H.; Ewald, M., Identification of alkylphenanthrenes in shale oil and coal by liquid and capillary gas chromatography and high-resolution spectrofluorimetry (Shpol'skii effect), J. Chromatogr., 1987, 395, 217-228, https://doi.org/10.1016/S0021-9673(01)94112-3 . [all data]