1H,1H,13H-Tetracosafluoro-1-tridecanol

Kovats' RI, non-polar column, isothermal

Data compiled by: NIST Mass Spectrometry Data Center, William E. Wallace, director

Column type CapillaryCapillaryCapillary
Active phase Permaphase DMSPermaphase DMSPermaphase DMS
Column length (m) 50.50.50.
Carrier gas
Substrate
Column diameter (mm) 0.250.250.25
Phase thickness (μm) 1.01.01.0
Temperature (C) 160.170.180.
I 1193.1182.1170.
ReferenceBoneva and Kotov, 1992Boneva and Kotov, 1992Boneva and Kotov, 1992
Comment MSDC-RI MSDC-RI MSDC-RI

References

Boneva and Kotov, 1992
Boneva, S.; Kotov, St., Capillary gas chromatography of some telomeric fluoroalkanols, Chromatographia, 1992, 34, 9/10, 475-478, https://doi.org/10.1007/BF02290239 . [all data]