Megastigma-4,6,7-trien-3-one, 9-hydroxy

Van Den Dool and Kratz RI, non-polar column, temperature ramp

View large format table.

Column type Active phase I Reference Comment
CapillaryDB-11594.Adedeji, Hartman, et al., 199260. m/0.32 mm/0.25 μm, He, 40. C @ 3. min, 2. K/min, 280. C @ 10. min

References

Adedeji, Hartman, et al., 1992
Adedeji, J.; Hartman, T.G.; Lech, J.; Ho, C.-T., Characterization of glycosidically bound aroma compounds in the African Mango (Mangifera indica L.), J. Agric. Food Chem., 1992, 40, 4, 659-661, https://doi.org/10.1021/jf00016a028 . [all data]