1-Hexyne, 4,4-dimethyl

Kovats' RI, non-polar column, isothermal

View large format table.

Column type Active phase Temperature (C) I Reference Comment
CapillarySqualane80.718.Soják, Farkas, et al., 1991107. m/0.25 mm/0.40 μm, H2

References

Soják, Farkas, et al., 1991
Soják, L.; Farkas, P.; Ostrovský, I.; Janák, J.; Chrétien, J.R., Capillary gas chromatography of C5 - C13 branched alkynes on squalane and liquid crystal stationary phases, J. Chromatogr., 1991, 557, 241-253, https://doi.org/10.1016/S0021-9673(01)87136-3 . [all data]