6-β-Hydrohyprednisolone, MO TMS

Normal alkane RI, non-polar column, custom temperature program

View large format table.

Column type Active phase I Reference Comment
CapillaryMethyl Silicone3300.Rodchenkov, Vedenin, et al., 199112.5 m/0.20 mm/0.33 μm, He; Program: not specified

References

Rodchenkov, Vedenin, et al., 1991
Rodchenkov, G.M.; Vedenin, A.N.; Uralets, V.P.; Semenov, V.A., Characterization of prednisone, prednisolone and their metabolites by gas chromatography-mass spectrometry, J.Chromatography - Biomedical Applications, 1991, 565, 1-2, 45-51, https://doi.org/10.1016/0378-4347(91)80369-N . [all data]