4,5-Dihydroprednisolone, MO TMS

Normal alkane RI, non-polar column, custom temperature program

Data compiled by: NIST Mass Spectrometry Data Center, William E. Wallace, director

Column type Capillary
Active phase Methyl Silicone
Column length (m) 12.5
Carrier gas He
Substrate
Column diameter (mm) 0.20
Phase thickness (μm) 0.33
Program not specified
I 3130.
ReferenceRodchenkov, Vedenin, et al., 1991
Comment MSDC-RI

References

Rodchenkov, Vedenin, et al., 1991
Rodchenkov, G.M.; Vedenin, A.N.; Uralets, V.P.; Semenov, V.A., Characterization of prednisone, prednisolone and their metabolites by gas chromatography-mass spectrometry, J.Chromatography - Biomedical Applications, 1991, 565, 1-2, 45-51, https://doi.org/10.1016/0378-4347(91)80369-N . [all data]