4H-Cyclopenteno[2,3-e]pyrido[1,2-a]pyrimidin-4-one, 7-methyl

Kovats' RI, non-polar column, isothermal

View large format table.

Column type Active phase Temperature (C) I Reference Comment
PackedOV-1220.2084.Papp, Szász, et al., 1991N2, Chromosorb W AW DMCS; Column length: 1.8 m

References

Papp, Szász, et al., 1991
Papp, O.; Szász, Gy.; Kökösi, J.; Hermecz, I., Correlation between structure and gas chromatographic behaviour of nitrogen-containing heterocyclic compounds. I. Methyl substitution of pyridopyrimidine derivatives, J. Chromatogr., 1991, 537, 365-370, https://doi.org/10.1016/S0021-9673(01)88909-3 . [all data]