4H-Cyclopenteno[2,3-e]pyrido[1,2-a]pyrimidin-4-one, 6,7,8,9-tetrahydro, 7-methyl

Kovats' RI, non-polar column, isothermal

Data compiled by: NIST Mass Spectrometry Data Center, William E. Wallace, director

Column type Packed
Active phase OV-1
Column length (m) 1.8
Carrier gas N2
Substrate Chromosorb W AW DMCS
Column diameter (mm)
Phase thickness (μm)
Temperature (C) 220.
I 1998.
ReferencePapp, Szász, et al., 1991
Comment MSDC-RI

References

Papp, Szász, et al., 1991
Papp, O.; Szász, Gy.; Kökösi, J.; Hermecz, I., Correlation between structure and gas chromatographic behaviour of nitrogen-containing heterocyclic compounds. I. Methyl substitution of pyridopyrimidine derivatives, J. Chromatogr., 1991, 537, 365-370, https://doi.org/10.1016/S0021-9673(01)88909-3 . [all data]