1-(8-Bromo-2,3,6,7-tetrahydrodibenzo[1,2-b; 4,5-b']difuran-4-yl-2-aminopropane, N-methyl

Normal alkane RI, non-polar column, temperature ramp

View large format table.

Column type Active phase I Reference Comment
CapillaryDB-1 MS2204.Zaitsu, Katagi, et al., 201030. m/0.25 mm/0.25 μm, Helium, 80. C @ 1. min, 15. K/min; Tend: 320. C
CapillaryDB-5 MS2259.Zaitsu, Katagi, et al., 201030. m/0.25 mm/0.25 μm, Helium, 80. C @ 1. min, 15. K/min; Tend: 320. C

References

Zaitsu, Katagi, et al., 2010
Zaitsu, K.; Katagi, M.; Kamata, H.; Nakanishi, K.; Shima, N.; Komata, T.; Nishioka, H.; Miki, A.; Tatsuma, M.; Tsuchihashi, H., Simultaneous analysis of six novel hallucinogenic (tetrahydrobenzodifuranyl) aminoalkanes (FLYs) and (benzodifuranyl) aminoalkanes (DragonFLYs) by GC-MS, LC-MS, and LC-MS-MS, Forensic Toxicol., 2010, 28, 1, 9-18, https://doi.org/10.1007/s11419-009-0083-0 . [all data]