exo-Arbozyl tiglate

Normal alkane RI, polar column, temperature ramp

Data compiled by: NIST Mass Spectrometry Data Center, William E. Wallace, director

Column type Capillary
Active phase Carbowax PEG CB
Column length (m) 30.
Carrier gas Helium
Substrate
Column diameter (mm) 0.25
Phase thickness (μm) 0.25
Tstart (C) 60.
Tend (C) 246.
Heat rate (K/min) 3.
Initial hold (min)
Final hold (min)
I 2364.
ReferenceAdams and Dev, 2010
Comment MSDC-RI

References

Adams and Dev, 2010
Adams, R.P.; Dev, V., Synthesis and GC-MS analysis of angelates and tiglates as an aid to identification of these components in essential oils, Flavour Fragr. J., 2010, 25, 2, 71-74, https://doi.org/10.1002/ffj.1968 . [all data]