Fentanyl, 4-N-nonyl analogue

Normal alkane RI, non-polar column, temperature ramp

Data compiled by: NIST Mass Spectrometry Data Center, William E. Wallace, director

Column type CapillaryCapillaryCapillaryCapillaryCapillary
Active phase BP-5BP-5BP-5BP-5BP-5
Column length (m) 25.25.25.25.25.
Carrier gas NitrogenNitrogenNitrogenNitrogenNitrogen
Substrate
Column diameter (mm) 0.220.220.220.220.22
Phase thickness (μm) 0.250.250.250.250.25
Tstart (C) 100.100.100.100.100.
Tend (C) 250.250.250.250.250.
Heat rate (K/min) 20.20.20.20.30.
Initial hold (min)
Final hold (min)
I 2765.2776.2778.2789.2777.
ReferenceManral, Gupta, et al., 2008Manral, Gupta, et al., 2008Manral, Gupta, et al., 2008Manral, Gupta, et al., 2008Manral, Gupta, et al., 2008
Comment MSDC-RI MSDC-RI MSDC-RI MSDC-RI MSDC-RI
Column type CapillaryCapillary
Active phase BP-5BP-5
Column length (m) 25.25.
Carrier gas NitrogenNitrogen
Substrate
Column diameter (mm) 0.220.22
Phase thickness (μm) 0.250.25
Tstart (C) 100.100.
Tend (C) 250.250.
Heat rate (K/min) 40.50.
Initial hold (min)
Final hold (min)
I 2780.2790.
ReferenceManral, Gupta, et al., 2008Manral, Gupta, et al., 2008
Comment MSDC-RI MSDC-RI

References

Manral, Gupta, et al., 2008
Manral, L.; Gupta, P.K.; Ganesan, K.; Malhotra, R.C., Gas chromatographic retention indices of fentanyl and its analogues, J. Chromatogr. Sci., 2008, 46, 7, 551-555, https://doi.org/10.1093/chromsci/46.6.551 . [all data]