Fentanyl, 4-N-(3-butenyl) analogue

Normal alkane RI, non-polar column, isothermal

View large format table.

Column type Active phase Temperature (C) I Reference Comment
CapillaryBP-5220.2266.Manral, Gupta, et al., 200825. m/0.22 mm/0.25 μm, Nitrogen
CapillaryBP-5250.2275.Manral, Gupta, et al., 200825. m/0.22 mm/0.25 μm, Nitrogen

Normal alkane RI, non-polar column, temperature ramp

View large format table.

Column type Active phase I Reference Comment
CapillaryBP-52277.Manral, Gupta, et al., 200825. m/0.22 mm/0.25 μm, Nitrogen, 20. K/min; Tstart: 100. C; Tend: 250. C
CapillaryBP-52288.Manral, Gupta, et al., 200825. m/0.22 mm/0.25 μm, Nitrogen, 20. K/min; Tstart: 100. C; Tend: 250. C
CapillaryBP-52289.Manral, Gupta, et al., 200825. m/0.22 mm/0.25 μm, Nitrogen, 20. K/min; Tstart: 100. C; Tend: 250. C
CapillaryBP-52290.Manral, Gupta, et al., 200825. m/0.22 mm/0.25 μm, Nitrogen, 20. K/min; Tstart: 100. C; Tend: 250. C
CapillaryBP-52282.Manral, Gupta, et al., 200825. m/0.22 mm/0.25 μm, Nitrogen, 30. K/min; Tstart: 100. C; Tend: 250. C
CapillaryBP-52283.Manral, Gupta, et al., 200825. m/0.22 mm/0.25 μm, Nitrogen, 40. K/min; Tstart: 100. C; Tend: 250. C
CapillaryBP-52287.Manral, Gupta, et al., 200825. m/0.22 mm/0.25 μm, Nitrogen, 50. K/min; Tstart: 100. C; Tend: 250. C

References

Manral, Gupta, et al., 2008
Manral, L.; Gupta, P.K.; Ganesan, K.; Malhotra, R.C., Gas chromatographic retention indices of fentanyl and its analogues, J. Chromatogr. Sci., 2008, 46, 7, 551-555, https://doi.org/10.1093/chromsci/46.6.551 . [all data]