Neosenkirkine

Normal alkane RI, non-polar column, temperature ramp

Data compiled by: NIST Mass Spectrometry Data Center, William E. Wallace, director

Column type Capillary
Active phase HP-5 MS
Column length (m) 30.
Carrier gas Helium
Substrate
Column diameter (mm) 0.25
Phase thickness (μm) 0.25
Tstart (C) 100.
Tend (C) 280.
Heat rate (K/min) 5.
Initial hold (min) 2.
Final hold (min) 20.
I 2617.
ReferenceChristov and Evstatieva, 2003
Comment MSDC-RI

References

Christov and Evstatieva, 2003
Christov, V.; Evstatieva, L., Alkaloid profile of Bulgarian species from genus Senecio L., Z. Naturforsch., 2003, 58c, 300-302. [all data]