8-Episarracine

Normal alkane RI, non-polar column, temperature ramp

View large format table.

Column type Active phase I Reference Comment
CapillaryHP-5 MS2492.Christov and Evstatieva, 200330. m/0.25 mm/0.25 μm, Helium, 100. C @ 2. min, 5. K/min, 280. C @ 20. min

References

Christov and Evstatieva, 2003
Christov, V.; Evstatieva, L., Alkaloid profile of Bulgarian species from genus Senecio L., Z. Naturforsch., 2003, 58c, 300-302. [all data]