Whiskey lactone (5-Butyl-4-methyloxolan-2-one)

Normal alkane RI, polar column, custom temperature program

Data compiled by: NIST Mass Spectrometry Data Center, William E. Wallace, director

Column type CapillaryCapillary
Active phase DB-WaxDB-Wax
Column length (m) 30.30.
Carrier gas HeliumHelium
Substrate
Column diameter (mm) 0.250.25
Phase thickness (μm) 0.250.25
Program not specifiednot specified
I 1910.1910.
ReferenceWelke, Manfroi, et al., 2012Welke, Manfroi, et al., 2012
Comment MSDC-RI MSDC-RI

References

Welke, Manfroi, et al., 2012
Welke, J.E.; Manfroi, V.; Zanus, M.; Lazarotto, M.; Zini, C.A., Characterization of the volatile profile of Brazilian merlot wines through comprehensive two dimensional gas chromatography time-of-flight mass spectrometric detection, J. Chromatogr. A, 2012, 1226, 124-139, https://doi.org/10.1016/j.chroma.2012.01.002 . [all data]