1-Diazopentan-2-one

Normal alkane RI, non-polar column, temperature ramp

Data compiled by: NIST Mass Spectrometry Data Center, William E. Wallace, director

Column type CapillaryCapillary
Active phase HP-5 MSHP-5 MS
Column length (m) 25.25.
Carrier gas HeliumHelium
Substrate
Column diameter (mm) 0.200.20
Phase thickness (μm) 0.330.33
Tstart (C) 45.45.
Tend (C) 280.280.
Heat rate (K/min) 5.5.
Initial hold (min) 1.1.
Final hold (min) 2.2.
I 930.957.
ReferenceKornilova, Ukolov, et al., 2012Kornilova, Ukolov, et al., 2012
Comment MSDC-RI MSDC-RI

References

Kornilova, Ukolov, et al., 2012
Kornilova, T.A.; Ukolov, A.I.; Kostikov, R.R.; Zenkevich, I.G., Stability of diazocarbonyl compounds under the conditions of gas chromatography and chromatography-mass spectrometry analysis, Rus. J. General Chem., 2012, 82, 10, 1675-1685, https://doi.org/10.1134/S1070363212100088 . [all data]