4-Hydroxy-7,8-dihydro-β-ionone

Normal alkane RI, non-polar column, custom temperature program

Data compiled by: NIST Mass Spectrometry Data Center, William E. Wallace, director

Column type Capillary
Active phase CP-Sil 5 CB
Column length (m) 50.
Carrier gas Nitrogen
Substrate
Column diameter (mm) 0.32
Phase thickness (μm) 1.20
Program 36 0C 20 0C/min -> 85 0C 1 0C/min -> 145 0C 3 0C/min -> 250 0C
I 1373.
ReferenceCollin, Nizet, et al., 2012
Comment MSDC-RI

References

Collin, Nizet, et al., 2012
Collin, S.; Nizet, S.; Bouuaert, T.C.; Despartures, P.-M., MAin odorants in Jura Flor-Sherry wines. Relative contributions of sotolon, abhexon, and theaspirane-derived compounds, J. Agr. Food Chem., 2012, 60, 1, 380-381, https://doi.org/10.1021/jf203832c . [all data]