Methyl strictate

Normal alkane RI, non-polar column, temperature ramp

View large format table.

Column type Active phase I Reference Comment
CapillaryDB-52430.Pattiram, Lasekan, et al., 201130. m/0.32 mm/0.25 μm, Helium, 2. K/min; Tstart: 35. C; Tend: 200. C

References

Pattiram, Lasekan, et al., 2011
Pattiram, P.D.; Lasekan, O.; Tan, C.P.; Zaidul, I.S.M., Identification of the aroma-active constituents of the essential oils of Water Dropwort (Oenanthe javanica) and Kacip Fatimah (Labisia pumilia), Int. Food Res. J., 2011, 18, 3, 1021-1026. [all data]