Dehydrogeosinin

Normal alkane RI, non-polar column, temperature ramp

Data compiled by: NIST Mass Spectrometry Data Center, William E. Wallace, director

Column type Capillary
Active phase DB-5
Column length (m) 30.
Carrier gas Helium
Substrate
Column diameter (mm) 0.32
Phase thickness (μm) 0.25
Tstart (C) 35.
Tend (C) 200.
Heat rate (K/min) 2.
Initial hold (min)
Final hold (min)
I 1361.
ReferencePattiram, Lasekan, et al., 2011
Comment MSDC-RI

References

Pattiram, Lasekan, et al., 2011
Pattiram, P.D.; Lasekan, O.; Tan, C.P.; Zaidul, I.S.M., Identification of the aroma-active constituents of the essential oils of Water Dropwort (Oenanthe javanica) and Kacip Fatimah (Labisia pumilia), Int. Food Res. J., 2011, 18, 3, 1021-1026. [all data]