Junenol

Normal alkane RI, non-polar column, custom temperature program

Data compiled by: NIST Mass Spectrometry Data Center, William E. Wallace, director

Column type Capillary
Active phase DB-5 MS
Column length (m) 30.
Carrier gas Helium
Substrate
Column diameter (mm) 0.25
Phase thickness (μm)
Program 50 0C (1.5 min) 4 0C/min -> 200 0C 10 0C/min -> 300 0C (10 min)
I 1622.
ReferenceLima, Quintans-Junior, et al., 2011
Comment MSDC-RI

References

Lima, Quintans-Junior, et al., 2011
Lima, G.M.; Quintans-Junior, L.J.; Thomazzi, S.M.; Almeida, E.M.S.A.; Melo, M.S.; Serafini, M.R.; Cavalcanti, S.C.H.; Gelain, D.P.; Santos, J.P.A.; Blank, A.F.; Alves, P.B.; Neta, P.M.O.; Lima, J.T.; Rocha, R.F.; Moreira, J.C.F.; Araujo, A.A.S., Phytochemical screening, antinociceptive and anti-inflammatory activities of Chrysopogon zizanioides essential oil, Braz. J. Pharmacognosy, 2011, 1-8. [all data]