trans-p-Mentha-8-methylthio-3-one

Normal alkane RI, polar column, custom temperature program

Data compiled by: NIST Mass Spectrometry Data Center, William E. Wallace, director

Column type Capillary
Active phase Innowax FSC
Column length (m) 60.
Carrier gas Helium
Substrate
Column diameter (mm) 0.25
Phase thickness (μm) 0.25
Program 60 0C (10 min) 4 0C/min -> 220 0C (10 min) 1 0C/min -> 240 0C
I 1916.
ReferenceDemirci, Temel, et al., 2011
Comment MSDC-RI

References

Demirci, Temel, et al., 2011
Demirci, B.; Temel, H.E.; Portakai, T.; Kirmizibekmez, H.; Demirci, F.; Baser, K.H.C., Inhibitory effect of Calamintha neleta subsp. glandulosa essential oil on lipoxygenase, Turk. J. Biochem., 2011, 36, 4, 290-295. [all data]