Isoaromadendrene oxide

Normal alkane RI, non-polar column, temperature ramp

Data compiled by: NIST Mass Spectrometry Data Center, William E. Wallace, director

Column type Capillary
Active phase DB-5 MS
Column length (m) 30.
Carrier gas Helium
Substrate
Column diameter (mm) 0.25
Phase thickness (μm) 0.25
Tstart (C) 60.
Tend (C) 270.
Heat rate (K/min) 3.
Initial hold (min)
Final hold (min)
I 1590.
ReferenceCui, Yang, et al., 2011
Comment MSDC-RI

References

Cui, Yang, et al., 2011
Cui, J.; Yang, X.; Dong, A.-J.; Cheng, D.-Y.; Wang, J.; Zhao, H.-T.; Xu, R.-B.; Wang, P.; Li, W.-J., Chemical composition and antioxidant activity of Wuphorbia fischeriana essential oil from China, J. Med. Plants Res., 2011, 5, 19, 4894-4798. [all data]