Mephedrone M (nor-dihydro), erythro, 2Ac

Normal alkane RI, non-polar column, temperature ramp

View large format table.

Column type Active phase I Reference Comment
CapillaryHP-11885.Meyer, Willheim, et al., 201012. m/0.20 mm/0.33 μm, 100. C @ 3. min, 30. K/min, 310. C @ 8. min

References

Meyer, Willheim, et al., 2010
Meyer, M.R.; Willheim, J.; Peters, F.T.; Maurer, H.H., Beta-keto amphetamines: studies on the metabolism of the designer drug mephedrone and toxicological detection of mephedrone, butylone, and methylone in urine using gas chromatography - mass pectrometry, Anal. Bioanal. Chem., 2010, 397, 3, 1225-1233, https://doi.org/10.1007/s00216-010-3636-5 . [all data]